Information card for entry 2311820
Original IUCr paper | HTML |
Chemical name | 1-Benzoyl-2-(1,1-diphenylpropan-2-ylidene)hydrazone |
Formula | C22 H20 N2 O |
Calculated formula | C22 H20 N2 O |
SMILES | O=C(N/N=C(C(c1ccccc1)c1ccccc1)\C)c1ccccc1 |
Title of publication | Structural similarities among eight benzoylhydrazones. |
Authors of publication | Ton, Quoc Cuong; Bolte, Michael; Egert, Ernst |
Journal of publication | Acta crystallographica. Section C, Structural chemistry |
Year of publication | 2014 |
Journal volume | 70 |
Journal issue | Pt 9 |
Pages of publication | 912 - 919 |
a | 11.1869 ± 0.0008 Å |
b | 7.9143 ± 0.0006 Å |
c | 20.233 ± 0.002 Å |
α | 90° |
β | 92.967 ± 0.006° |
γ | 90° |
Cell volume | 1789 ± 0.3 Å3 |
Cell temperature | 173 ± 2 K |
Ambient diffraction temperature | 173 ± 2 K |
Number of distinct elements | 4 |
Space group number | 14 |
Hermann-Mauguin space group symbol | P 1 21/n 1 |
Hall space group symbol | -P 2yn |
Residual factor for all reflections | 0.0394 |
Residual factor for significantly intense reflections | 0.0304 |
Weighted residual factors for significantly intense reflections | 0.0813 |
Weighted residual factors for all reflections included in the refinement | 0.083 |
Goodness-of-fit parameter for all reflections included in the refinement | 1.1 |
Diffraction radiation wavelength | 0.71073 Å |
Diffraction radiation type | MoKα |