Information card for entry 4000578
Common name | Trilutetiumpentaborate |
Chemical name | Trilutetiumpentaborate |
Formula | B5 Lu3 O12 |
Calculated formula | B5 Lu3 O12 |
Title of publication | Associating Borate and Silicate Chemistry by Extreme Conditions: High-Pressure Synthesis, Crystal Structure, and Properties of the New Borates RE~3~B~5~O~12~ (RE = Er–Lu) |
Authors of publication | Emme, Holger; Valldor, Martin; Pöttgen, Rainer; Huppertz, Hubert |
Journal of publication | Chemistry of Materials |
Year of publication | 2005 |
Journal volume | 17 |
Journal issue | 10 |
Pages of publication | 2707 - 2715 |
a | 12.7651 ± 0.0004 Å |
b | 4.575 ± 0.0002 Å |
c | 12.4418 ± 0.0004 Å |
α | 90° |
β | 90° |
γ | 90° |
Cell volume | 726.605 ± 0.045 Å3 |
Cell temperature | 200 ± 2 K |
Ambient diffraction temperature | 200 ± 2 K |
Number of distinct elements | 3 |
Space group number | 53 |
Hermann-Mauguin space group symbol | P m n a |
Hall space group symbol | -P 2ac 2 |
Residual factor for all reflections | 0.0566 |
Residual factor for significantly intense reflections | 0.029 |
Weighted residual factors for significantly intense reflections | 0.0776 |
Weighted residual factors for all reflections included in the refinement | 0.085 |
Goodness-of-fit parameter for all reflections included in the refinement | 0.957 |
Diffraction radiation wavelength | 0.71073 Å |
Diffraction radiation type | MoKα |