Information card for entry 4001043
Formula |
C14 O5 V |
Calculated formula |
C14 O5 V |
SMILES |
[V]12OC(c3ccccc3)=[O][V]34(OC(c5ccccc5)=[O]1)(O2)OC(c1ccccc1)=[O][V](OC(c1ccccc1)=[O]3)O4 |
Title of publication |
Structural Characterization of a Nanocrystalline Inorganic−Organic Hybrid with Fiberlike Morphology and One-Dimensional Antiferromagnetic Properties |
Authors of publication |
Djerdj, Igor; Cao, Minhua; Rocquefelte, Xavier; Černý, Radovan; Jagličić, Zvonko; Arčon, Denis; Potočnik, Anton; Gozzo, Fabia; Niederberger, Markus |
Journal of publication |
Chemistry of Materials |
Year of publication |
2009 |
Journal volume |
21 |
Journal issue |
14 |
Pages of publication |
3356 |
a |
20.652 ± 0.003 Å |
b |
6.798 ± 0.001 Å |
c |
9.954 ± 0.001 Å |
α |
90° |
β |
92.145 ± 0.006° |
γ |
90° |
Cell volume |
1396.5 ± 0.3 Å3 |
Cell temperature |
293 K |
Ambient diffraction temperature |
293 K |
Number of distinct elements |
3 |
Space group number |
5 |
Hermann-Mauguin space group symbol |
C 1 2 1 |
Hall space group symbol |
C 2y |
Residual factor R(I) for significantly intense reflections |
1.02 |
Method of determination |
powder diffraction |
Diffraction radiation wavelength |
1.03469 Å |
Diffraction radiation type |
synchrotron |
Yes |
No |
No |