Information card for entry 4001656
Formula | Bi11 Eu14 Mn |
Calculated formula | Bi11 Eu14 Mn |
Title of publication | Synthesis, Structure, and Magnetic Properties of the Rare-Earth Zintl Compounds Eu14MnPn11and Eu14InPn11(Pn = Sb, Bi) |
Authors of publication | Chan, Julia Y.; Wang, Mary E.; Rehr, Anette; Kauzlarich, Susan M.; Webb, David J. |
Journal of publication | Chemistry of Materials |
Year of publication | 1997 |
Journal volume | 9 |
Journal issue | 10 |
Pages of publication | 2131 |
a | 17.632 ± 0.004 Å |
b | 17.632 ± 0.004 Å |
c | 23.047 ± 0.006 Å |
α | 90° |
β | 90° |
γ | 90° |
Cell volume | 7165 ± 3 Å3 |
Cell temperature | 130 ± 2 K |
Ambient diffraction temperature | 130 ± 2 K |
Number of distinct elements | 3 |
Space group number | 142 |
Hermann-Mauguin space group symbol | I 41/a c d :2 |
Hall space group symbol | -I 4bd 2c |
Residual factor for all reflections | 0.0803 |
Residual factor for significantly intense reflections | 0.0453 |
Weighted residual factors for all reflections | 0.0896 |
Weighted residual factors for significantly intense reflections | 0.0782 |
Goodness-of-fit parameter for all reflections | 0.987 |
Goodness-of-fit parameter for significantly intense reflections | 1.045 |
Diffraction radiation wavelength | 0.71073 Å |
Diffraction radiation type | MoKα |