Information card for entry 4001908
Common name | Yttrium copper tellurite sulfate |
Formula | Cu O14 S2 Te2 Y2 |
Calculated formula | Cu O14 S2 Te2 Y2 |
Title of publication | Challenges in the Search for Magnetic Coupling in 3d/4f Materials: Syntheses, Structures, and Magnetic Properties of the Lanthanide Copper Heterobimetallic Compounds, RE2Cu(TeO3)2(SO4)2 |
Authors of publication | Lin, Jian; Chai, Ping; Diefenbach, Kariem; Shatruk, Michael; Albrecht-Schmitt, Thomas E. |
Journal of publication | Chemistry of Materials |
Year of publication | 2014 |
Journal volume | 26 |
Journal issue | 6 |
Pages of publication | 2187 |
a | 5.1645 ± 0.0004 Å |
b | 7.8154 ± 0.0006 Å |
c | 8.1013 ± 0.0006 Å |
α | 62.654 ± 0.002° |
β | 73.88 ± 0.002° |
γ | 85.266 ± 0.002° |
Cell volume | 278.64 ± 0.04 Å3 |
Cell temperature | 298 ± 2 K |
Ambient diffraction temperature | 298 ± 2 K |
Number of distinct elements | 5 |
Space group number | 2 |
Hermann-Mauguin space group symbol | P -1 |
Hall space group symbol | -P 1 |
Residual factor for all reflections | 0.0263 |
Residual factor for significantly intense reflections | 0.0201 |
Weighted residual factors for significantly intense reflections | 0.0407 |
Weighted residual factors for all reflections included in the refinement | 0.0424 |
Goodness-of-fit parameter for all reflections included in the refinement | 1.055 |
Diffraction radiation wavelength | 0.71073 Å |
Diffraction radiation type | MoKα |