Information card for entry 4001910
Common name | Samarium copper tellurite sulfate |
Formula | Cu O14 S2 Sm2 Te2 |
Calculated formula | Cu O14 S2 Sm2 Te2 |
Title of publication | Challenges in the Search for Magnetic Coupling in 3d/4f Materials: Syntheses, Structures, and Magnetic Properties of the Lanthanide Copper Heterobimetallic Compounds, RE2Cu(TeO3)2(SO4)2 |
Authors of publication | Lin, Jian; Chai, Ping; Diefenbach, Kariem; Shatruk, Michael; Albrecht-Schmitt, Thomas E. |
Journal of publication | Chemistry of Materials |
Year of publication | 2014 |
Journal volume | 26 |
Journal issue | 6 |
Pages of publication | 2187 |
a | 5.214 ± 0.0006 Å |
b | 7.9348 ± 0.0009 Å |
c | 8.2384 ± 0.0009 Å |
α | 62.411 ± 0.001° |
β | 73.982 ± 0.001° |
γ | 85.422 ± 0.001° |
Cell volume | 289.89 ± 0.06 Å3 |
Cell temperature | 298 ± 2 K |
Ambient diffraction temperature | 298 ± 2 K |
Number of distinct elements | 5 |
Space group number | 2 |
Hermann-Mauguin space group symbol | P -1 |
Hall space group symbol | -P 1 |
Residual factor for all reflections | 0.0196 |
Residual factor for significantly intense reflections | 0.0194 |
Weighted residual factors for significantly intense reflections | 0.0504 |
Weighted residual factors for all reflections included in the refinement | 0.0505 |
Goodness-of-fit parameter for all reflections included in the refinement | 1.191 |
Diffraction radiation wavelength | 0.71073 Å |