Information card for entry 4002011
Formula | Al1.33 B5.33 Lu1.33 |
Calculated formula | Al1.33333 B5.33333 Lu1.33333 |
Title of publication | Crystal Structure and Physical Properties of Polymorphs of LnAlB4(Ln = Yb, Lu) |
Authors of publication | Macaluso, Robin T.; Nakatsuji, Satoru; Kuga, Kentaro; Thomas, Evan Lyle; Machida, Yo; Maeno, Yoshiteru; Fisk, Zachary; Chan, Julia Y. |
Journal of publication | Chemistry of Materials |
Year of publication | 2007 |
Journal volume | 19 |
Journal issue | 8 |
Pages of publication | 1918 |
a | 5.905 ± 0.0001 Å |
b | 11.444 ± 0.0002 Å |
c | 3.51 ± 0.0004 Å |
α | 90° |
β | 90° |
γ | 90° |
Cell volume | 237.19 ± 0.03 Å3 |
Cell temperature | 299 ± 2 K |
Ambient diffraction temperature | 299 ± 2 K |
Number of distinct elements | 3 |
Space group number | 55 |
Hermann-Mauguin space group symbol | P b a m |
Hall space group symbol | -P 2 2ab |
Residual factor for all reflections | 0.0257 |
Residual factor for significantly intense reflections | 0.0249 |
Weighted residual factors for significantly intense reflections | 0.0624 |
Weighted residual factors for all reflections included in the refinement | 0.063 |
Goodness-of-fit parameter for all reflections included in the refinement | 1.234 |
Diffraction radiation wavelength | 0.71073 Å |
Diffraction radiation type | MoKα |