Information card for entry 4002069
Formula |
As2 Co1.7 La |
Calculated formula |
As2 Co1.696 La |
Title of publication |
Tunable Cobalt Vacancies and Related Properties in LaCoxAs2 |
Authors of publication |
Shen, Shijie; Wang, Gang; Jin, Shifeng; Huang, Qingzhen; Ying, Tianping; Li, Dandan; Lai, Xiaofang; Zhou, Tingting; Zhang, Han; Lin, Zhiping; Wu, Xiaozhi; Chen, Xiaolong |
Journal of publication |
Chemistry of Materials |
Year of publication |
2014 |
Journal volume |
26 |
Journal issue |
21 |
Pages of publication |
6221 |
a |
4.052 ± 0.0003 Å |
b |
4.052 ± 0.0003 Å |
c |
10.3598 ± 0.0008 Å |
α |
90° |
β |
90° |
γ |
90° |
Cell volume |
170.09 ± 0.02 Å3 |
Cell temperature |
298 ± 2 K |
Ambient diffraction temperature |
298 ± 2 K |
Number of distinct elements |
3 |
Space group number |
139 |
Hermann-Mauguin space group symbol |
I 4/m m m |
Hall space group symbol |
-I 4 2 |
Residual factor R(I) for significantly intense reflections |
22.261 |
Goodness-of-fit parameter for all reflections |
2.13 |
Method of determination |
powder diffraction |
Diffraction radiation wavelength |
1.78897 Å |
Diffraction radiation type |
CoKα |
Yes |
No |
No |