Information card for entry 4002932
Formula |
C53 H32.67 In2 O10.67 |
Calculated formula |
C53 H28 In2 O10.6667 |
Title of publication |
Solvent-Assisted, Thermally Triggered Structural Transformation in Flexible Mesoporous Metal‒Organic Frameworks |
Authors of publication |
Pang, Jiandong; Wu, Mingyan; Qin, Jun-Sheng; Liu, Caiping; Lollar, Christina T.; Yuan, Daqiang; Hong, Maochun; Zhou, Hong-Cai |
Journal of publication |
Chemistry of Materials |
Year of publication |
2019 |
a |
30.346 ± 0.004 Å |
b |
30.346 Å |
c |
35.303 ± 0.004 Å |
α |
90° |
β |
90° |
γ |
120° |
Cell volume |
28154 ± 5 Å3 |
Cell temperature |
150 ± 2 K |
Ambient diffraction temperature |
150 ± 2 K |
Number of distinct elements |
4 |
Space group number |
192 |
Hermann-Mauguin space group symbol |
P 6/m c c |
Hall space group symbol |
-P 6 2c |
Residual factor for all reflections |
0.0396 |
Residual factor for significantly intense reflections |
0.033 |
Weighted residual factors for significantly intense reflections |
0.0785 |
Weighted residual factors for all reflections included in the refinement |
0.0795 |
Goodness-of-fit parameter for all reflections included in the refinement |
0.937 |
Diffraction radiation wavelength |
1.54184 Å |
Diffraction radiation type |
CuKα |
Yes |
No |
No |