Information card for entry 4003431
Common name | NaUBO |
Formula | B12 Na2 O26 U2 |
Calculated formula | B12 Na2 O26 U2 |
Title of publication | Introducing Uranium as the Activator toward Highly Stable Narrow-Band Green Emitters with Near-Unity Quantum Efficiency |
Authors of publication | Liu, Wei; Song, Enhai; Cheng, Liwei; Song, Liping; Xie, Jian; Li, Guodong; Zhang, Yugang; Wang, Yanlong; Wang, Yaxing; Xia, Zhiguo; Chai, Zhifang; Wang, Shuao |
Journal of publication | Chemistry of Materials |
Year of publication | 2019 |
a | 6.4244 ± 0.0009 Å |
b | 11.1727 ± 0.0016 Å |
c | 16.207 ± 0.002 Å |
α | 90° |
β | 94.208 ± 0.004° |
γ | 90° |
Cell volume | 1160.2 ± 0.3 Å3 |
Cell temperature | 296 ± 2 K |
Ambient diffraction temperature | 296 ± 2 K |
Number of distinct elements | 4 |
Space group number | 9 |
Hermann-Mauguin space group symbol | C 1 c 1 |
Hall space group symbol | C -2yc |
Residual factor for all reflections | 0.0255 |
Residual factor for significantly intense reflections | 0.0243 |
Weighted residual factors for significantly intense reflections | 0.0663 |
Weighted residual factors for all reflections included in the refinement | 0.0668 |
Goodness-of-fit parameter for all reflections included in the refinement | 1.124 |
Diffraction radiation wavelength | 0.71073 Å |
Diffraction radiation type | MoKα |