Information card for entry 4004017
Formula | C6 H16 Bi I5 N2 |
Calculated formula | C6 H16 Bi I5 N2 |
Title of publication | Bismuth/Silver-Based Two-Dimensional Iodide Double and One-Dimensional Bi Perovskites: Interplay between Structural and Electronic Dimensions |
Authors of publication | Li, Xiaotong; Traoré, Boubacar; Kepenekian, Mikaël; Li, Linda; Stoumpos, Constantinos C.; Guo, Peijun; Even, Jacky; Katan, Claudine; Kanatzidis, Mercouri G. |
Journal of publication | Chemistry of Materials |
Year of publication | 2021 |
a | 10.24 ± 0.002 Å |
b | 8.4579 ± 0.0017 Å |
c | 21.347 ± 0.004 Å |
α | 90° |
β | 90.14 ± 0.03° |
γ | 90° |
Cell volume | 1848.8 ± 0.6 Å3 |
Cell temperature | 293 ± 2 K |
Ambient diffraction temperature | 293 ± 2 K |
Number of distinct elements | 5 |
Space group number | 4 |
Hermann-Mauguin space group symbol | P 1 21 1 |
Hall space group symbol | P 2yb |
Residual factor for all reflections | 0.0406 |
Residual factor for significantly intense reflections | 0.0331 |
Weighted residual factors for significantly intense reflections | 0.0752 |
Weighted residual factors for all reflections included in the refinement | 0.0779 |
Goodness-of-fit parameter for all reflections included in the refinement | 1.066 |
Diffraction radiation wavelength | 0.71073 Å |
Diffraction radiation type | MoKα |