Information card for entry 4004021
Formula | C6 H16.5 Ag0.5 Bi0.5 I4 N2 O0.25 |
Calculated formula | C6 H16.25 Ag0.5 Bi0.5 I4 N2 O0.25 |
Title of publication | Bismuth/Silver-Based Two-Dimensional Iodide Double and One-Dimensional Bi Perovskites: Interplay between Structural and Electronic Dimensions |
Authors of publication | Li, Xiaotong; Traoré, Boubacar; Kepenekian, Mikaël; Li, Linda; Stoumpos, Constantinos C.; Guo, Peijun; Even, Jacky; Katan, Claudine; Kanatzidis, Mercouri G. |
Journal of publication | Chemistry of Materials |
Year of publication | 2021 |
a | 34.988 ± 0.007 Å |
b | 8.4789 ± 0.0017 Å |
c | 22.226 ± 0.004 Å |
α | 90° |
β | 96.92 ± 0.03° |
γ | 90° |
Cell volume | 6546 ± 2 Å3 |
Cell temperature | 293 ± 2 K |
Ambient diffraction temperature | 293 ± 2 K |
Number of distinct elements | 7 |
Space group number | 15 |
Hermann-Mauguin space group symbol | C 1 2/c 1 |
Hall space group symbol | -C 2yc |
Residual factor for all reflections | 0.0724 |
Residual factor for significantly intense reflections | 0.0316 |
Weighted residual factors for significantly intense reflections | 0.0532 |
Weighted residual factors for all reflections included in the refinement | 0.0605 |
Goodness-of-fit parameter for all reflections included in the refinement | 0.891 |
Diffraction radiation wavelength | 0.71073 Å |
Diffraction radiation type | MoKα |