Information card for entry 4022257
Formula | C13 H16 Cl3 N O7 |
Calculated formula | C13 H16 Cl3 N O7 |
SMILES | ClC(Cl)(Cl)C(=O)N[C@H]1[C@H](OC(=O)C)[C@H](OC(=O)C)[C@@H](OC(=O)C)C1.ClC(Cl)(Cl)C(=O)N[C@@H]1[C@@H](OC(=O)C)[C@@H](OC(=O)C)[C@H](OC(=O)C)C1 |
Title of publication | Directed Dihydroxylation of Cyclic Allylic Alcohols and Trichloroacetamides Using OsO~4~/TMEDA |
Authors of publication | Timothy J. Donohoe; Kevin Blades; Peter R. Moore; Michael J. Waring; Jon J. G. Winter; Madeleine Helliwell; Nicholas J. Newcombe; Geoffrey Stemp |
Journal of publication | Journal of Organic Chemistry |
Year of publication | 2002 |
Journal volume | 67 |
Pages of publication | 7946 - 7956 |
a | 10.2633 ± 0.0018 Å |
b | 10.9378 ± 0.0013 Å |
c | 9.7783 ± 0.0018 Å |
α | 115.014 ± 0.011° |
β | 115.946 ± 0.012° |
γ | 74.141 ± 0.013° |
Cell volume | 889.2 ± 0.2 Å3 |
Cell temperature | 293 ± 2 K |
Ambient diffraction temperature | 296.2 K |
Number of distinct elements | 5 |
Space group number | 2 |
Hermann-Mauguin space group symbol | P -1 |
Hall space group symbol | -P 1 |
Residual factor for all reflections | 0.0631 |
Residual factor for significantly intense reflections | 0.0574 |
Weighted residual factors for significantly intense reflections | 0.1589 |
Weighted residual factors for all reflections included in the refinement | 0.1672 |
Goodness-of-fit parameter for all reflections included in the refinement | 1.053 |
Diffraction radiation wavelength | 1.5418 Å |
Diffraction radiation type | CuKα |