Information card for entry 4022630
Common name | gamma-lactones |
Formula | C11 H16 O4 |
Calculated formula | C11 H16 O4 |
SMILES | O1C(=O)[C@@H]([C@H]2[C@@H]1CCCC2)[C@@H](C(=O)O)C.O1C(=O)[C@H]([C@@H]2[C@H]1CCCC2)[C@H](C(=O)O)C |
Title of publication | Facile Chemo-, Regio-, and Diastereoselective Approach to cis-3,5-Disubstituted γ-Butyrolactones and Fused γ-Butyrolactones |
Authors of publication | Md. Merajuddin Baag; Vedavati G. Puranik; Narshinha P. Argade |
Journal of publication | Journal of Organic Chemistry |
Year of publication | 2007 |
Journal volume | 72 |
Pages of publication | 1009 - 1012 |
a | 5.2387 ± 0.0007 Å |
b | 34.215 ± 0.005 Å |
c | 6.2694 ± 0.0008 Å |
α | 90° |
β | 109.54 ± 0.003° |
γ | 90° |
Cell volume | 1059 ± 0.2 Å3 |
Cell temperature | 293 ± 2 K |
Ambient diffraction temperature | 293 ± 2 K |
Number of distinct elements | 3 |
Space group number | 14 |
Hermann-Mauguin space group symbol | P 1 21/n 1 |
Hall space group symbol | -P 2yn |
Residual factor for all reflections | 0.1258 |
Residual factor for significantly intense reflections | 0.0807 |
Weighted residual factors for significantly intense reflections | 0.1436 |
Weighted residual factors for all reflections included in the refinement | 0.1595 |
Goodness-of-fit parameter for all reflections included in the refinement | 1.159 |
Diffraction radiation wavelength | 0.71073 Å |
Diffraction radiation type | MoKα |