Information card for entry 4022779
Common name | Cyclobutaindene |
Formula | C18 H20 O4 |
Calculated formula | C18 H20 O4 |
SMILES | O1[C@@]2([C@@H]3[C@H](c4c5C(=O)OCc5c(O)cc14)C([C@@H]3CC2)(C)C)C.O1[C@]2([C@H]3[C@@H](c4c5C(=O)OCc5c(O)cc14)C([C@H]3CC2)(C)C)C |
Title of publication | A Facile Phenol-Driven Intramolecular Diastereoselective Thermal/Base-Catalyzed Dipolar [2 + 2] Annulation Reactions: An Easy Access to Complex Bioactive Natural and Unnatural Benzopyran Congeners |
Authors of publication | Mukulesh Mondal; Vedavati G. Puranik; Narshinha P. Argade |
Journal of publication | Journal of Organic Chemistry |
Year of publication | 2007 |
Journal volume | 72 |
Pages of publication | 2068 - 2076 |
a | 13.3486 ± 0.0015 Å |
b | 7.963 ± 0.0009 Å |
c | 13.8757 ± 0.0015 Å |
α | 90° |
β | 93.676 ± 0.002° |
γ | 90° |
Cell volume | 1471.9 ± 0.3 Å3 |
Cell temperature | 297 ± 2 K |
Ambient diffraction temperature | 297 ± 2 K |
Number of distinct elements | 3 |
Space group number | 14 |
Hermann-Mauguin space group symbol | P 1 21/c 1 |
Hall space group symbol | -P 2ybc |
Residual factor for all reflections | 0.1036 |
Residual factor for significantly intense reflections | 0.0501 |
Weighted residual factors for significantly intense reflections | 0.1043 |
Weighted residual factors for all reflections included in the refinement | 0.1259 |
Goodness-of-fit parameter for all reflections included in the refinement | 1.01 |
Diffraction radiation wavelength | 0.71073 Å |
Diffraction radiation type | MoKα |