Information card for entry 4023206
Common name | compound 2H+ |
Chemical name | (3S*,5R*,7aR*,9aS*)-3,5-di(4-methoxyphenyl)perhydrocyclopenta[ij] quinolizine trifluoroacetate |
Formula | C56 H66 Cl6 F6 N2 O8 |
Calculated formula | C56 H66 Cl6 F6 N2 O8 |
Title of publication | Chair to Boat Interconversion and Face to Face Interactions in Isomeric Aryl-Substituted Perhydrocyclopentaquinolizines |
Authors of publication | Lodovico Lunazzi; Andrea Mazzanti; Shaik Rafi; H. Surya Prakash Rao |
Journal of publication | Journal of Organic Chemistry |
Year of publication | 2008 |
Journal volume | 73 |
Pages of publication | 678 - 688 |
a | 16.6403 ± 0.0016 Å |
b | 13.4738 ± 0.0013 Å |
c | 25.472 ± 0.003 Å |
α | 90° |
β | 95.429 ± 0.002° |
γ | 90° |
Cell volume | 5685.4 ± 1 Å3 |
Cell temperature | 273 ± 2 K |
Ambient diffraction temperature | 273 ± 2 K |
Number of distinct elements | 6 |
Space group number | 14 |
Hermann-Mauguin space group symbol | P 1 21/c 1 |
Hall space group symbol | -P 2ybc |
Residual factor for all reflections | 0.0904 |
Residual factor for significantly intense reflections | 0.0634 |
Weighted residual factors for significantly intense reflections | 0.1957 |
Weighted residual factors for all reflections included in the refinement | 0.21 |
Goodness-of-fit parameter for all reflections included in the refinement | 1.104 |
Diffraction radiation wavelength | 0.71073 Å |
Diffraction radiation type | MoKα |