Information card for entry 4023277
Formula | C24 H22 O4 |
Calculated formula | C24 H22 O4 |
Title of publication | Rh-Catalyzed Formation of Dioxolanes from α-Alkyl Diazoesters: Diastereoselective Cycloadditions of Carbonyl Ylides with Selectivity over β-Hydride Elimination |
Authors of publication | Andrew DeAngelis; Patricia Panne; Glenn P. A. Yap; Joseph M. Fox |
Journal of publication | Journal of Organic Chemistry |
Year of publication | 2008 |
Journal volume | 73 |
Pages of publication | 1435 - 1439 |
a | 11.035 ± 0.003 Å |
b | 12.04 ± 0.003 Å |
c | 16.164 ± 0.004 Å |
α | 70.833 ± 0.004° |
β | 82.474 ± 0.004° |
γ | 86.437 ± 0.004° |
Cell volume | 2010.7 ± 0.9 Å3 |
Cell temperature | 120 ± 2 K |
Ambient diffraction temperature | 120 ± 2 K |
Number of distinct elements | 3 |
Space group number | 2 |
Hermann-Mauguin space group symbol | P -1 |
Hall space group symbol | -P 1 |
Residual factor for all reflections | 0.0528 |
Residual factor for significantly intense reflections | 0.0432 |
Weighted residual factors for significantly intense reflections | 0.1181 |
Weighted residual factors for all reflections included in the refinement | 0.1254 |
Goodness-of-fit parameter for all reflections included in the refinement | 1.042 |
Diffraction radiation wavelength | 0.71073 Å |
Diffraction radiation type | MoKα |