Information card for entry 4023292
Formula | C31 H27 N O2 S |
Calculated formula | C31 H27 N O2 S |
SMILES | S(=O)(=O)(N1C(C)c2ccccc2C(=C=C(c2ccccc2)c2ccccc2)C1)c1ccc(cc1)C |
Title of publication | One-Step Synthesis of Substituted Dihydro- and Tetrahydroisoquinolines by FeCl~3~.6H~2~O Catalyzed Intramolecular Friedel-Crafts Reaction of Benzylamino-Substituted Propargylic Alcohols |
Authors of publication | Wen Huang; Quansheng Shen; Jialiang Wang; Xigeng Zhou |
Journal of publication | Journal of Organic Chemistry |
Year of publication | 2008 |
Journal volume | 73 |
Pages of publication | 1586 - 1589 |
a | 11.668 ± 0.004 Å |
b | 9.058 ± 0.003 Å |
c | 24.293 ± 0.009 Å |
α | 90° |
β | 91.502 ± 0.006° |
γ | 90° |
Cell volume | 2566.7 ± 1.7 Å3 |
Cell temperature | 293 ± 2 K |
Ambient diffraction temperature | 293 ± 2 K |
Number of distinct elements | 5 |
Space group number | 14 |
Hermann-Mauguin space group symbol | P 1 21/n 1 |
Hall space group symbol | -P 2yn |
Residual factor for all reflections | 0.084 |
Residual factor for significantly intense reflections | 0.0491 |
Weighted residual factors for significantly intense reflections | 0.1225 |
Weighted residual factors for all reflections included in the refinement | 0.1415 |
Goodness-of-fit parameter for all reflections included in the refinement | 1.019 |
Diffraction radiation wavelength | 0.71073 Å |
Diffraction radiation type | MoKα |