Information card for entry 4023360
Formula | C30 H64 Cl N5 P2 Pd |
Calculated formula | C30 H64 Cl N5 P2 Pd |
SMILES | [Pd]12(C[CH]1=[CH]2C)(Cl)[P](C(C)(C)C)(C(C)(C)C)N=P12N(CC(C)C)CCN(CCN1CC(C)C)CCN2CC(C)C |
Title of publication | (t-Bu)~2~PN=P(i-BuNCH~2~CH~2~)~3~N: New Efficient Ligand for Palladium-Catalyzed C-N Couplings of Aryl and Heteroaryl Bromides and Chlorides and for Vinyl Bromides at Room Temperature |
Authors of publication | Ch. Venkat Reddy; Jesudoss V. Kingston; John G. Verkade |
Journal of publication | Journal of Organic Chemistry |
Year of publication | 2008 |
Journal volume | 73 |
Pages of publication | 3047 - 3062 |
a | 21.476 ± 0.004 Å |
b | 17.488 ± 0.003 Å |
c | 18.801 ± 0.003 Å |
α | 90° |
β | 96.611 ± 0.003° |
γ | 90° |
Cell volume | 7014 ± 2 Å3 |
Cell temperature | 173 ± 2 K |
Ambient diffraction temperature | 173 ± 2 K |
Number of distinct elements | 6 |
Space group number | 14 |
Hermann-Mauguin space group symbol | P 1 21/c 1 |
Hall space group symbol | -P 2ybc |
Residual factor for all reflections | 0.0754 |
Residual factor for significantly intense reflections | 0.0473 |
Weighted residual factors for significantly intense reflections | 0.0933 |
Weighted residual factors for all reflections included in the refinement | 0.1049 |
Goodness-of-fit parameter for all reflections included in the refinement | 1.043 |
Diffraction radiation wavelength | 0.71073 Å |
Diffraction radiation type | MoKα |