Information card for entry 4023390
Formula | C21 H33 N O5 |
Calculated formula | C21 H33 N O5 |
SMILES | O=C1N(CC[C@H](CC1)C(C)(C)C)[C@H](CO)c1cc(OC)c(OC)c(OC)c1.O=C1N(CC[C@@H](CC1)C(C)(C)C)[C@@H](CO)c1cc(OC)c(OC)c(OC)c1 |
Title of publication | Nonbonded, Attractive Cation-π Interactions in Azide-Mediated Asymmetric Ring Expansion Reactions |
Authors of publication | Christopher E. Katz; Timothy Ribelin; Donna Withrow; Yashar Basseri; Anna K. Manukyan; Amy Bermudez; Christian G Nuera; Victor W. Day; Douglas R. Powell; Jennifer L. Poutsma; Jeffrey Aubé |
Journal of publication | Journal of Organic Chemistry |
Year of publication | 2008 |
Journal volume | 73 |
Pages of publication | 3318 - 3327 |
a | 29.491 ± 0.005 Å |
b | 10.35 ± 0.0016 Å |
c | 13.652 ± 0.002 Å |
α | 90° |
β | 90° |
γ | 90° |
Cell volume | 4167.1 ± 1.1 Å3 |
Cell temperature | 100 ± 2 K |
Ambient diffraction temperature | 100 ± 2 K |
Number of distinct elements | 4 |
Space group number | 60 |
Hermann-Mauguin space group symbol | P b c n |
Hall space group symbol | -P 2n 2ab |
Residual factor for all reflections | 0.1013 |
Residual factor for significantly intense reflections | 0.0555 |
Weighted residual factors for significantly intense reflections | 0.1214 |
Weighted residual factors for all reflections included in the refinement | 0.1361 |
Goodness-of-fit parameter for all reflections included in the refinement | 0.974 |
Diffraction radiation wavelength | 0.71073 Å |
Diffraction radiation type | MoKα |