Information card for entry 4023392
Formula | C18 H33 N O2 |
Calculated formula | C18 H33 N O2 |
SMILES | O=C1N(CC[C@H](CC1)C(C)(C)C)[C@@H](CO)C1CCCCC1.O=C1N(CC[C@@H](CC1)C(C)(C)C)[C@H](CO)C1CCCCC1 |
Title of publication | Nonbonded, Attractive Cation-π Interactions in Azide-Mediated Asymmetric Ring Expansion Reactions |
Authors of publication | Christopher E. Katz; Timothy Ribelin; Donna Withrow; Yashar Basseri; Anna K. Manukyan; Amy Bermudez; Christian G Nuera; Victor W. Day; Douglas R. Powell; Jennifer L. Poutsma; Jeffrey Aubé |
Journal of publication | Journal of Organic Chemistry |
Year of publication | 2008 |
Journal volume | 73 |
Pages of publication | 3318 - 3327 |
a | 11.1702 ± 0.0011 Å |
b | 12.0677 ± 0.0011 Å |
c | 14.2415 ± 0.0013 Å |
α | 88.983 ± 0.002° |
β | 71.954 ± 0.002° |
γ | 71.686 ± 0.002° |
Cell volume | 1726.1 ± 0.3 Å3 |
Cell temperature | 100 ± 2 K |
Ambient diffraction temperature | 100 ± 2 K |
Number of distinct elements | 4 |
Space group number | 2 |
Hermann-Mauguin space group symbol | P -1 |
Hall space group symbol | -P 1 |
Residual factor for all reflections | 0.0807 |
Residual factor for significantly intense reflections | 0.0639 |
Weighted residual factors for significantly intense reflections | 0.143 |
Weighted residual factors for all reflections included in the refinement | 0.1507 |
Goodness-of-fit parameter for all reflections included in the refinement | 1.094 |
Diffraction radiation wavelength | 0.71073 Å |
Diffraction radiation type | MoKα |