Information card for entry 4023397
Formula | C18 H14 N2 O2 |
Calculated formula | C18 H14 N2 O2 |
SMILES | n1c(C23N(C(=O)c4c2cccc4)CCC3)oc2c1cccc2 |
Title of publication | Palladium-Catalyzed Intramolecular C-Arylation of Benzylic Carbon: Synthesis of 3-Benzoxazolylisoindolinones by a Sequence of Ugi-4CR/Postfunctionalization |
Authors of publication | Angela Salcedo; Luc Neuville; Jieping Zhu |
Journal of publication | Journal of Organic Chemistry |
Year of publication | 2008 |
Journal volume | 73 |
Pages of publication | 3600 - 3603 |
a | 18.849 ± 0.002 Å |
b | 7.479 ± 0.001 Å |
c | 19.864 ± 0.002 Å |
α | 90° |
β | 90° |
γ | 90° |
Cell volume | 2800.3 ± 0.6 Å3 |
Cell temperature | 293 ± 2 K |
Ambient diffraction temperature | 293 ± 2 K |
Number of distinct elements | 4 |
Space group number | 61 |
Hermann-Mauguin space group symbol | P b c a |
Hall space group symbol | -P 2ac 2ab |
Residual factor for all reflections | 0.0638 |
Residual factor for significantly intense reflections | 0.0397 |
Weighted residual factors for significantly intense reflections | 0.0952 |
Weighted residual factors for all reflections included in the refinement | 0.1076 |
Goodness-of-fit parameter for all reflections included in the refinement | 1.047 |
Diffraction radiation wavelength | 0.71069 Å |
Diffraction radiation type | MoKα |