Information card for entry 4023404
Formula | C7 H7 N O3 S |
Calculated formula | C7 H7 N O3 S |
Title of publication | Synthesis, Structure, and E-Z Isomerization of β-(Hetero)aryl-α,β-enals |
Authors of publication | Patricia Martínez-Bescos; Fernando Cagide-Fagín; Luis F. Roa; Juan Carlos Ortiz-Lara; Krzysztof Kierus; Lidia Ozores-Viturro; Marta Fernández-González; Ricardo Alonso |
Journal of publication | Journal of Organic Chemistry |
Year of publication | 2008 |
Journal volume | 73 |
Pages of publication | 3745 - 3753 |
a | 11.4493 ± 0.0001 Å |
b | 5.0645 ± 0.0001 Å |
c | 13.6414 ± 0.0001 Å |
α | 90° |
β | 105.983 ± 0.001° |
γ | 90° |
Cell volume | 760.42 ± 0.02 Å3 |
Cell temperature | 100 ± 2 K |
Ambient diffraction temperature | 100 ± 2 K |
Number of distinct elements | 5 |
Space group number | 14 |
Hermann-Mauguin space group symbol | P 1 21/n 1 |
Hall space group symbol | -P 2yn |
Residual factor for all reflections | 0.0402 |
Residual factor for significantly intense reflections | 0.0361 |
Weighted residual factors for significantly intense reflections | 0.1039 |
Weighted residual factors for all reflections included in the refinement | 0.1062 |
Goodness-of-fit parameter for all reflections included in the refinement | 1.074 |
Diffraction radiation probe | x-ray |
Diffraction radiation wavelength | 0.7107 Å |
Diffraction radiation type | MoKα |