Information card for entry 4023406
Formula | C20 H39 N O Si |
Calculated formula | C20 H39 N O Si |
SMILES | [Si]([C@H]1[C@H](C2CCCCC2)[C@H]1C(=O)N(CC)CC)(C)(C(C)(C)C)C.[Si]([C@@H]1[C@@H](C2CCCCC2)[C@@H]1C(=O)N(CC)CC)(C)(C(C)(C)C)C |
Title of publication | CrCl~2~-Promoted Stereospecific and Stereoselective Alkyl- and Silylcyclopropanation of α,β-Unsaturated Amides |
Authors of publication | José M. Concellón; Humberto Rodríguez-Solla; Carmen Méjica; Elena G. Blanco; Santiago García-Granda; M. Rosario Díaz |
Journal of publication | Journal of Organic Chemistry |
Year of publication | 2008 |
Journal volume | 73 |
Pages of publication | 3828 - 3836 |
a | 18.5294 ± 0.0008 Å |
b | 11.6563 ± 0.0004 Å |
c | 10.6108 ± 0.0004 Å |
α | 90° |
β | 95.899 ± 0.002° |
γ | 90° |
Cell volume | 2279.63 ± 0.15 Å3 |
Cell temperature | 293 ± 2 K |
Ambient diffraction temperature | 293 ± 2 K |
Number of distinct elements | 5 |
Space group number | 14 |
Hermann-Mauguin space group symbol | P 1 21/c 1 |
Hall space group symbol | -P 2ybc |
Residual factor for all reflections | 0.1212 |
Residual factor for significantly intense reflections | 0.0579 |
Weighted residual factors for significantly intense reflections | 0.1094 |
Weighted residual factors for all reflections included in the refinement | 0.1329 |
Goodness-of-fit parameter for all reflections included in the refinement | 1.18 |
Diffraction radiation wavelength | 1.54184 Å |
Diffraction radiation type | CuKα |