Information card for entry 4023421
Common name | diRh27 |
Formula | C42 H44 N2 O4 Rh |
Calculated formula | C42 H44 N2 O4 Rh |
Title of publication | Axial Coordination of NHC Ligands on Dirhodium(II) Complexes: Generation of a New Family of Catalysts |
Authors of publication | Alexandre F. Trindade; Pedro M. P. Gois; Luís F. Veiros; Vânia André; M. Teresa Duarte; Carlos A. M. Afonso; Stephen Cack; F. Geoffrey; N. Cloke |
Journal of publication | Journal of Organic Chemistry |
Year of publication | 2008 |
Journal volume | 73 |
Pages of publication | 4076 - 4086 |
a | 11.256 ± 0.005 Å |
b | 12.538 ± 0.005 Å |
c | 15.367 ± 0.005 Å |
α | 69.613 ± 0.005° |
β | 84.172 ± 0.005° |
γ | 77.614 ± 0.005° |
Cell volume | 1984.7 ± 1.3 Å3 |
Cell temperature | 150 ± 2 K |
Ambient diffraction temperature | 293 ± 2 K |
Number of distinct elements | 5 |
Space group number | 2 |
Hermann-Mauguin space group symbol | P -1 |
Hall space group symbol | -P 1 |
Residual factor for all reflections | 0.0943 |
Residual factor for significantly intense reflections | 0.0673 |
Weighted residual factors for significantly intense reflections | 0.1707 |
Weighted residual factors for all reflections included in the refinement | 0.2022 |
Goodness-of-fit parameter for all reflections included in the refinement | 1.166 |
Diffraction radiation wavelength | 0.71069 Å |
Diffraction radiation type | MoKα |