Information card for entry 4023424
Common name | diRh30 |
Formula | C35 H50 N2 O8 Rh2 |
Calculated formula | C35 H50 N2 O8 Rh2 |
SMILES | [Rh]1234([Rh]([O]=C(O4)C)(OC(=[O]2)C)([O]=C(O1)C)OC(=[O]3)C)=C1N(CCN1c1c(cccc1C(C)C)C(C)C)c1c(cccc1C(C)C)C(C)C |
Title of publication | Axial Coordination of NHC Ligands on Dirhodium(II) Complexes: Generation of a New Family of Catalysts |
Authors of publication | Alexandre F. Trindade; Pedro M. P. Gois; Luís F. Veiros; Vânia André; M. Teresa Duarte; Carlos A. M. Afonso; Stephen Cack; F. Geoffrey; N. Cloke |
Journal of publication | Journal of Organic Chemistry |
Year of publication | 2008 |
Journal volume | 73 |
Pages of publication | 4076 - 4086 |
a | 12.659 ± 0.004 Å |
b | 15.502 ± 0.002 Å |
c | 18.822 ± 0.003 Å |
α | 90° |
β | 90° |
γ | 90° |
Cell volume | 3693.6 ± 1.4 Å3 |
Cell temperature | 150 ± 2 K |
Ambient diffraction temperature | 150 ± 2 K |
Number of distinct elements | 5 |
Space group number | 19 |
Hermann-Mauguin space group symbol | P 21 21 21 |
Hall space group symbol | P 2ac 2ab |
Residual factor for all reflections | 0.0591 |
Residual factor for significantly intense reflections | 0.0422 |
Weighted residual factors for significantly intense reflections | 0.073 |
Weighted residual factors for all reflections included in the refinement | 0.0779 |
Goodness-of-fit parameter for all reflections included in the refinement | 0.955 |
Diffraction radiation wavelength | 0.71069 Å |
Diffraction radiation type | MoKα |