Information card for entry 4023428
Formula | C42 H47 Cl2 F3 N3 O2 Ru |
Calculated formula | C42 H47 Cl2 F3 N3 O2 Ru |
Title of publication | Aminocarbonyl Group Containing Hoveyda-Grubbs-Type Complexes: Synthesis and Activity in Olefin Metathesis Transformations |
Authors of publication | Diane Rix; Fréderic Caijo; Isabelle Lauret; Fabien Boeda; Hervé Clavier; Steven P. Nolan; Marc Mauduit |
Journal of publication | Journal of Organic Chemistry |
Year of publication | 2008 |
Journal volume | 73 |
Pages of publication | 4225 - 4228 |
a | 25.7951 ± 0.001 Å |
b | 14.0364 ± 0.0005 Å |
c | 22.2949 ± 0.0009 Å |
α | 90° |
β | 94.551 ± 0.002° |
γ | 90° |
Cell volume | 8046.9 ± 0.5 Å3 |
Cell temperature | 100 ± 2 K |
Ambient diffraction temperature | 100 ± 2 K |
Number of distinct elements | 7 |
Space group number | 15 |
Hermann-Mauguin space group symbol | C 1 2/c 1 |
Hall space group symbol | -C 2yc |
Residual factor for all reflections | 0.0368 |
Residual factor for significantly intense reflections | 0.0306 |
Weighted residual factors for significantly intense reflections | 0.0783 |
Weighted residual factors for all reflections included in the refinement | 0.0834 |
Goodness-of-fit parameter for all reflections included in the refinement | 1.039 |
Diffraction radiation wavelength | 0.71073 Å |
Diffraction radiation type | MoKα |