Information card for entry 4023465
Formula | C62 H92 O24 P2 S2.79 Se1.22 |
Calculated formula | C62 H92 O24 P2 S2.792 Se1.208 |
Title of publication | Synthesis and Solid-State Study of Supramolecular Host-Guest Assemblies: Bis[6-O,6-O'-(1,2:3,4-diisopropylidene-α-D- galactopyranosyl)thiophosphoryl] Dichalcogenides |
Authors of publication | Marek J. Potrzebowski; Wojciech M. Potrzebowski; Agata Jeziorna; Wlodzimierz Ciesielski; Jarosław Gajda; Grzegorz D. Bujacz; Maksymilian Chruszcz; Wladek Minor |
Journal of publication | Journal of Organic Chemistry |
Year of publication | 2008 |
Journal volume | 73 |
Pages of publication | 4388 - 4397 |
a | 29.875 ± 0.001 Å |
b | 10.4 ± 0.001 Å |
c | 11.628 ± 0.001 Å |
α | 90° |
β | 93.891 ± 0.001° |
γ | 90° |
Cell volume | 3604.5 ± 0.5 Å3 |
Cell temperature | 103 ± 1 K |
Ambient diffraction temperature | 103 ± 1 K |
Number of distinct elements | 6 |
Space group number | 5 |
Hermann-Mauguin space group symbol | C 1 2 1 |
Hall space group symbol | C 2y |
Residual factor for all reflections | 0.0597 |
Residual factor for significantly intense reflections | 0.0377 |
Weighted residual factors for significantly intense reflections | 0.0941 |
Weighted residual factors for all reflections included in the refinement | 0.1015 |
Goodness-of-fit parameter for all reflections included in the refinement | 1.105 |
Method of determination | single crystal |
Diffraction radiation probe | x-ray |
Diffraction radiation wavelength | 0.71074 Å |
Diffraction radiation type | MoKα |
Diffraction radiation X-ray symbol | K-L~2,3~ |