Information card for entry 4023502
Formula | C28 H46 N10 O6 |
Calculated formula | C28 H46 N10 O6 |
SMILES | C1(=O)c2cccc(C(=O)NCCNCCNCCNC(=O)c3cccc(C(=O)NCCNCCNCCN1)n3)n2.OC.CO |
Title of publication | Anion and Carboxylic Acid Binding to Monotopic and Ditopic Amidopyridine Macrocycles |
Authors of publication | Ivan V. Korendovych; Mimi Cho; Olga V. Makhlynets; Phillip L. Butler; Richard J. Staples; Elena V. Rybak-Akimova |
Journal of publication | Journal of Organic Chemistry |
Year of publication | 2008 |
Journal volume | 73 |
Pages of publication | 4771 - 4782 |
a | 9.1721 ± 0.0007 Å |
b | 9.4004 ± 0.0007 Å |
c | 10.7902 ± 0.0008 Å |
α | 102.07 ± 0.001° |
β | 115.017 ± 0.001° |
γ | 92.109 ± 0.001° |
Cell volume | 816.15 ± 0.11 Å3 |
Cell temperature | 303 ± 2 K |
Ambient diffraction temperature | 303 ± 2 K |
Number of distinct elements | 4 |
Space group number | 2 |
Hermann-Mauguin space group symbol | P -1 |
Hall space group symbol | -P 1 |
Residual factor for all reflections | 0.059 |
Residual factor for significantly intense reflections | 0.0489 |
Weighted residual factors for significantly intense reflections | 0.1322 |
Weighted residual factors for all reflections included in the refinement | 0.1443 |
Goodness-of-fit parameter for all reflections included in the refinement | 1.021 |
Diffraction radiation wavelength | 0.71073 Å |
Diffraction radiation type | MoKα |