Information card for entry 4023504
Formula | C19 H23 Br N4 O6 |
Calculated formula | C19 H23 Br N4 O6 |
Title of publication | Fully Orthogonally Protected 2-Deoxystreptamine from Kanamycin |
Authors of publication | M. Waqar Aslam; Guuske F. Busscher; David P. Weiner; René de Gelder; Floris P. J. T. Rutjes; Floris L. va Delft |
Journal of publication | Journal of Organic Chemistry |
Year of publication | 2008 |
Journal volume | 73 |
Pages of publication | 5131 - 5134 |
a | 4.991 ± 0.0003 Å |
b | 11.0159 ± 0.0015 Å |
c | 39.504 ± 0.003 Å |
α | 90° |
β | 90° |
γ | 90° |
Cell volume | 2171.9 ± 0.4 Å3 |
Cell temperature | 208 ± 2 K |
Ambient diffraction temperature | 208 ± 2 K |
Number of distinct elements | 5 |
Space group number | 19 |
Hermann-Mauguin space group symbol | P 21 21 21 |
Hall space group symbol | P 2ac 2ab |
Residual factor for all reflections | 0.1681 |
Residual factor for significantly intense reflections | 0.0765 |
Weighted residual factors for all reflections | 0.1476 |
Weighted residual factors for significantly intense reflections | 0.1231 |
Weighted residual factors for all reflections included in the refinement | 0.1476 |
Goodness-of-fit parameter for all reflections | 1.071 |
Goodness-of-fit parameter for all reflections included in the refinement | 1.071 |
Diffraction radiation wavelength | 0.71073 Å |
Diffraction radiation type | MoKα |