Information card for entry 4023510
Formula | C35 H24 F3 N9 O6 |
Calculated formula | C35 H24 F3 N9 O6 |
Title of publication | 3,5,7,9-Substituted Hexaazaacridines: Toward Structures with Nearly Degenerate Singlet-Triplet Energy Separations |
Authors of publication | Peter Langer; Shadi Amiri; Anja Bodtke; Nehad N. R. Saleh; Klaus Weisz; Helmar Görls; Peter R. Schreier |
Journal of publication | Journal of Organic Chemistry |
Year of publication | 2008 |
Journal volume | 73 |
Pages of publication | 5048 - 5063 |
a | 16.8343 ± 0.0008 Å |
b | 8.9231 ± 0.0004 Å |
c | 22.4144 ± 0.0011 Å |
α | 90° |
β | 90.078 ± 0.003° |
γ | 90° |
Cell volume | 3367 ± 0.3 Å3 |
Cell temperature | 183 ± 2 K |
Ambient diffraction temperature | 183 ± 2 K |
Number of distinct elements | 5 |
Space group number | 13 |
Hermann-Mauguin space group symbol | P 1 2/n 1 |
Hall space group symbol | -P 2yac |
Residual factor for all reflections | 0.2018 |
Residual factor for significantly intense reflections | 0.0965 |
Weighted residual factors for significantly intense reflections | 0.2523 |
Weighted residual factors for all reflections included in the refinement | 0.3141 |
Goodness-of-fit parameter for all reflections included in the refinement | 1.038 |
Diffraction radiation wavelength | 0.71073 Å |
Diffraction radiation type | MoKα |