Information card for entry 4023535
Common name | Br(C14H8)(iPr2P=Se) |
Chemical name | 9-Brom-10-diisopropylselenophosphorylanthracene |
Formula | C20 H22 Br P Se |
Calculated formula | C20 H22 Br P Se |
SMILES | Brc1c2ccccc2c(c2ccccc12)P(C(C)C)(C(C)C)=[Se] |
Title of publication | Structural and Variable-Temperature NMR Studies of 9-Diisopropylphosphanylanthracenes and 9,10-Bis(diisopropylphosphanyl)anthracenes and Their Oxidation Products |
Authors of publication | Gerald Schwab; Daniel Stern; Dietmar Stalke |
Journal of publication | Journal of Organic Chemistry |
Year of publication | 2008 |
Journal volume | 73 |
Pages of publication | 5242 - 5247 |
a | 22.6134 ± 0.0014 Å |
b | 11.1967 ± 0.0007 Å |
c | 14.5751 ± 0.0009 Å |
α | 90° |
β | 93.468 ± 0.001° |
γ | 90° |
Cell volume | 3683.6 ± 0.4 Å3 |
Cell temperature | 100 ± 2 K |
Ambient diffraction temperature | 100 ± 2 K |
Number of distinct elements | 5 |
Space group number | 14 |
Hermann-Mauguin space group symbol | P 1 21/c 1 |
Hall space group symbol | -P 2ybc |
Residual factor for all reflections | 0.0235 |
Residual factor for significantly intense reflections | 0.0212 |
Weighted residual factors for significantly intense reflections | 0.0544 |
Weighted residual factors for all reflections included in the refinement | 0.0553 |
Goodness-of-fit parameter for all reflections included in the refinement | 1.084 |
Diffraction radiation wavelength | 0.71073 Å |
Diffraction radiation type | MoKα |