Information card for entry 4023545
Formula | C114 H224 N10 O101 |
Calculated formula | C114 H162 N10 O101 |
SMILES | n1(nncc1COc1ccc(N=Nc2ccccc2)cc1)C[C@H]1O[C@@H]2O[C@H]3[C@H](O)[C@@H](O)[C@@H](O[C@H]4[C@H](O)[C@@H](O)[C@@H](O[C@H]5[C@H](O)[C@@H](O)[C@@H](O[C@H]6[C@H](O)[C@@H](O)[C@@H](O[C@H]7[C@H](O)[C@@H](O)[C@@H](O[C@H]8[C@H](O)[C@@H](O)[C@@H](O[C@H]1[C@H](O)[C@H]2O)O[C@@H]8CO)O[C@@H]7CO)O[C@@H]6CO)O[C@@H]5CO)O[C@@H]4CO)O[C@@H]3CO.O.O.O.O.O.O.O.O.O.O.O.O.O.O.O.O |
Title of publication | Syntheses and Self-Assembly Behaviors of the Azobenzenyl Modified β-Cyclodextrins Isomers |
Authors of publication | Yu Liu; Zi-Xin Yang; Yong Chen |
Journal of publication | Journal of Organic Chemistry |
Year of publication | 2008 |
Journal volume | 73 |
Pages of publication | 5298 - 5304 |
a | 15.6068 ± 0.0019 Å |
b | 20.806 ± 0.003 Å |
c | 23.361 ± 0.003 Å |
α | 90° |
β | 91.114 ± 0.002° |
γ | 90° |
Cell volume | 7584.4 ± 1.6 Å3 |
Cell temperature | 113 ± 2 K |
Ambient diffraction temperature | 113 ± 2 K |
Number of distinct elements | 4 |
Space group number | 4 |
Hermann-Mauguin space group symbol | P 1 21 1 |
Hall space group symbol | P 2yb |
Residual factor for all reflections | 0.0826 |
Residual factor for significantly intense reflections | 0.0763 |
Weighted residual factors for significantly intense reflections | 0.201 |
Weighted residual factors for all reflections included in the refinement | 0.2079 |
Goodness-of-fit parameter for all reflections included in the refinement | 1.033 |
Diffraction radiation wavelength | 0.7107 Å |
Diffraction radiation type | MoKα |