Information card for entry 4023547
Formula | C22 H20 O2 |
Calculated formula | C22 H20 O2 |
SMILES | O1CCC2(C1=C(C(=CC2=O)C)c1ccc(cc1)C)c1ccccc1 |
Title of publication | Lewis Acid-Mediated Reactions of 1-Cyclopropyl-2-arylethanone Derivatives with Allenic Ester, Ethyl Acetoacetate, and Methyl Acrylate |
Authors of publication | Min Shi; Xiang-Ying Tang; Yong-Hua Yang |
Journal of publication | Journal of Organic Chemistry |
Year of publication | 2008 |
Journal volume | 73 |
Pages of publication | 5311 - 5318 |
a | 7.7748 ± 0.0012 Å |
b | 12.836 ± 0.002 Å |
c | 17.963 ± 0.003 Å |
α | 97.147 ± 0.003° |
β | 93.32 ± 0.003° |
γ | 100.103 ± 0.003° |
Cell volume | 1745.3 ± 0.5 Å3 |
Cell temperature | 293 ± 2 K |
Ambient diffraction temperature | 293 ± 2 K |
Number of distinct elements | 3 |
Space group number | 2 |
Hermann-Mauguin space group symbol | P -1 |
Hall space group symbol | -P 1 |
Residual factor for all reflections | 0.1216 |
Residual factor for significantly intense reflections | 0.0664 |
Weighted residual factors for significantly intense reflections | 0.1527 |
Weighted residual factors for all reflections included in the refinement | 0.1807 |
Goodness-of-fit parameter for all reflections included in the refinement | 0.827 |
Diffraction radiation wavelength | 0.71073 Å |
Diffraction radiation type | MoKα |