Information card for entry 4023567
Formula | C78 H88 Cl6 N2 O6 |
Calculated formula | C78 H88 Cl6 N2 O6 |
Title of publication | Experimental and Computational Studies of Selective Recognition of Hg^2+^ by Amide Linked Lower Rim 1,3-Dibenzimidazole Derivative of Calix[4]arene: Species Characterization in Solution and that in the Isolated Complex, Including the Delineation of the Nanostructures |
Authors of publication | Roymon Joseph; Balaji Ramanujam; Amitabha Acharya; Anupam Khutia; Chebrolu P. Rao |
Journal of publication | Journal of Organic Chemistry |
Year of publication | 2008 |
Journal volume | 73 |
Pages of publication | 5745 - 5758 |
a | 10.164 ± 0.005 Å |
b | 16.251 ± 0.005 Å |
c | 23.654 ± 0.005 Å |
α | 97.756 ± 0.005° |
β | 99.898 ± 0.005° |
γ | 96.042 ± 0.005° |
Cell volume | 3781 ± 2 Å3 |
Cell temperature | 293 ± 2 K |
Ambient diffraction temperature | 293 ± 2 K |
Number of distinct elements | 5 |
Space group number | 2 |
Hermann-Mauguin space group symbol | P -1 |
Hall space group symbol | -P 1 |
Residual factor for all reflections | 0.1313 |
Residual factor for significantly intense reflections | 0.0736 |
Weighted residual factors for significantly intense reflections | 0.1862 |
Weighted residual factors for all reflections included in the refinement | 0.2255 |
Goodness-of-fit parameter for all reflections included in the refinement | 1.026 |
Diffraction radiation wavelength | 0.71069 Å |
Diffraction radiation type | MoKα |