Information card for entry 4023599
Formula | C20 H28 Co2 O7 Si2 |
Calculated formula | C20 H28 Co2 O7 Si2 |
Title of publication | Co-Complexes Derived from Alkene Insertion to Alkyne-Dicobaltpentacarbonyl Complexes: Insight into the Regioselectivity of Pauson-Khand Reactions of Cyclopropenes |
Authors of publication | Mahesh K. Pallerla; Glenn P. A. Yap; Joseph M. Fox |
Journal of publication | Journal of Organic Chemistry |
Year of publication | 2008 |
Journal volume | 73 |
Pages of publication | 6137 - 6141 |
a | 9.8375 ± 0.0018 Å |
b | 32.245 ± 0.006 Å |
c | 9.035 ± 0.0017 Å |
α | 90° |
β | 114.599 ± 0.003° |
γ | 90° |
Cell volume | 2605.9 ± 0.8 Å3 |
Cell temperature | 298 ± 2 K |
Ambient diffraction temperature | 298 ± 2 K |
Number of distinct elements | 5 |
Space group number | 14 |
Hermann-Mauguin space group symbol | P 1 21/c 1 |
Hall space group symbol | -P 2ybc |
Residual factor for all reflections | 0.0708 |
Residual factor for significantly intense reflections | 0.0597 |
Weighted residual factors for significantly intense reflections | 0.1507 |
Weighted residual factors for all reflections included in the refinement | 0.1585 |
Goodness-of-fit parameter for all reflections included in the refinement | 1.061 |
Diffraction radiation wavelength | 0.71073 Å |
Diffraction radiation type | MoKα |