Information card for entry 4023602
Formula | C34 H42 O11 S |
Calculated formula | C34 H42 O11 S |
Title of publication | Studies Directed toward the Stereochemical Structure Determination of the Naturally Occurring Glucosidase Inhibitor, Kotalanol: Synthesis and Inhibitory Activities against Human Maltase Glucoamylase of Seven-Carbon, Chain-Extended Homologues of Salacinol |
Authors of publication | Ravindranath Nasi; Brian O. Patrick; Lyann Sim; David R. Rose; B. Mario Pinto |
Journal of publication | Journal of Organic Chemistry |
Year of publication | 2008 |
Journal volume | 73 |
Pages of publication | 6172 - 6181 |
a | 11.9908 ± 0.0014 Å |
b | 18.563 ± 0.002 Å |
c | 15.3829 ± 0.0017 Å |
α | 90° |
β | 95.461 ± 0.007° |
γ | 90° |
Cell volume | 3408.5 ± 0.7 Å3 |
Cell temperature | 296 ± 2 K |
Ambient diffraction temperature | 296 ± 2 K |
Number of distinct elements | 4 |
Space group number | 4 |
Hermann-Mauguin space group symbol | P 1 21 1 |
Hall space group symbol | P 2yb |
Residual factor for all reflections | 0.0855 |
Residual factor for significantly intense reflections | 0.0467 |
Weighted residual factors for significantly intense reflections | 0.1086 |
Weighted residual factors for all reflections included in the refinement | 0.1282 |
Goodness-of-fit parameter for all reflections included in the refinement | 1.009 |
Diffraction radiation wavelength | 0.71073 Å |
Diffraction radiation type | MoKα |