Information card for entry 4023634
Common name | cavitand |
Formula | C118 H120 N9 O16.5 |
Calculated formula | C118 H120 N9 O16.5 |
Title of publication | Interaction Energies and Dynamics of Acid-Base Pairs Isolated in Cavitands |
Authors of publication | Byron W. Purse; Sara M. Butterfield; Pablo Ballester; Alexander Shivanyuk; Julius Rebek, Jr. |
Journal of publication | Journal of Organic Chemistry |
Year of publication | 2008 |
Journal volume | 73 |
Pages of publication | 6480 - 6488 |
a | 15.501 ± 0.002 Å |
b | 18.249 ± 0.003 Å |
c | 22.303 ± 0.003 Å |
α | 91.827 ± 0.003° |
β | 107.458 ± 0.003° |
γ | 114.319 ± 0.003° |
Cell volume | 5396.1 ± 1.4 Å3 |
Cell temperature | 173 ± 2 K |
Ambient diffraction temperature | 173 ± 2 K |
Number of distinct elements | 4 |
Space group number | 2 |
Hermann-Mauguin space group symbol | P -1 |
Hall space group symbol | -P 1 |
Residual factor for all reflections | 0.2204 |
Residual factor for significantly intense reflections | 0.1339 |
Weighted residual factors for significantly intense reflections | 0.3283 |
Weighted residual factors for all reflections included in the refinement | 0.3855 |
Goodness-of-fit parameter for all reflections included in the refinement | 1.076 |
Diffraction radiation wavelength | 0.71073 Å |
Diffraction radiation type | MoKα |