Information card for entry 4023786
Formula | C19 H18 N2 O4 |
Calculated formula | C19 H18 N2 O4 |
SMILES | c12C(=O)N(c3ccccc3)N(C(c1cccc2)CC(=O)OC)C(=O)C |
Title of publication | Regioselective Synthesis of N-Aminoisoindolones and Mono-N- and Di-N,N'-substituted Phthalazones Utilizing Hydrazine Nucleophiles in a Palladium-Catalyzed Three-Component Cascade Process |
Authors of publication | Ronald Grigg; Visuvanathar Sridharan; Mufakhrul Shah; Simon Mutton; Colin Kilner; David MacPherson; Peter Milner |
Journal of publication | Journal of Organic Chemistry |
Year of publication | 2008 |
Journal volume | 73 |
Pages of publication | 8352 - 8356 |
a | 10.642 ± 0.0002 Å |
b | 8.3077 ± 0.0002 Å |
c | 38.1238 ± 0.0008 Å |
α | 90° |
β | 90° |
γ | 90° |
Cell volume | 3370.55 ± 0.12 Å3 |
Cell temperature | 150 ± 2 K |
Ambient diffraction temperature | 150 ± 2 K |
Number of distinct elements | 4 |
Space group number | 61 |
Hermann-Mauguin space group symbol | P b c a |
Hall space group symbol | -P 2ac 2ab |
Residual factor for all reflections | 0.1283 |
Residual factor for significantly intense reflections | 0.0872 |
Weighted residual factors for significantly intense reflections | 0.2063 |
Weighted residual factors for all reflections included in the refinement | 0.2456 |
Goodness-of-fit parameter for all reflections included in the refinement | 1.047 |
Diffraction radiation probe | x-ray |
Diffraction radiation wavelength | 0.71073 Å |
Diffraction radiation type | MoKα |