Information card for entry 4023871
Formula | C106.08 H140.17 F24 N6 O33.69 P4 |
Calculated formula | C106.085 H134.17 F24 N6 O33.695 P4 |
Title of publication | High-Yielding, Regiospecific Synthesis of cis(4,4')-Di(carbomethoxybenzo)-30-crown-10, Its Conversion to a Pyridyl Cryptand and Strong Complexation of 2,2'- and 4,4'-Bipyridinium Derivatives |
Authors of publication | Adam M.-P. Pederson; Elizabeth M. Ward; Daniel V. Schoonover; Carla Slebodnick; Harry W. Gibson |
Journal of publication | Journal of Organic Chemistry |
Year of publication | 2008 |
Journal volume | 73 |
Pages of publication | 9094 - 9101 |
a | 13.9013 ± 0.0005 Å |
b | 17.2987 ± 0.0006 Å |
c | 26.7004 ± 0.001 Å |
α | 84.77 ± 0.003° |
β | 76.048 ± 0.003° |
γ | 85.381 ± 0.003° |
Cell volume | 6194 ± 0.4 Å3 |
Cell temperature | 100 ± 2 K |
Ambient diffraction temperature | 100 ± 2 K |
Number of distinct elements | 6 |
Space group number | 2 |
Hermann-Mauguin space group symbol | P -1 |
Hall space group symbol | -P 1 |
Residual factor for all reflections | 0.1306 |
Residual factor for significantly intense reflections | 0.0849 |
Weighted residual factors for significantly intense reflections | 0.2229 |
Weighted residual factors for all reflections included in the refinement | 0.2676 |
Goodness-of-fit parameter for all reflections included in the refinement | 0.983 |
Diffraction radiation probe | x-ray |
Diffraction radiation wavelength | 1.54178 Å |
Diffraction radiation type | CuKα |