Information card for entry 4024735
Formula | C30 H47 N O3 S Sn |
Calculated formula | C30 H47 N O3 S Sn |
SMILES | [Sn]([C@H](N(S(=O)(=O)c1ccccc1)[C@@H](CO)c1ccccc1)CC=C)(CCCC)(CCCC)CCCC |
Title of publication | Synthesis of Highly Enantioenriched Chiral α-Aminoorganotins via Diastereoselective Ring Opening of Chiral N-(Arenesulfonyl) 2-Tributylstannyloxazolidines |
Authors of publication | Vincent Coeffard; Erwan Le Grognec; Isabelle Beaudet; Michel Evain; Jean-Paul Quintard |
Journal of publication | Journal of Organic Chemistry |
Year of publication | 2009 |
Journal volume | 74 |
Pages of publication | 5822 - 5838 |
a | 7.8641 ± 0.0007 Å |
b | 20.288 ± 0.002 Å |
c | 38.732 ± 0.003 Å |
α | 90° |
β | 90° |
γ | 90° |
Cell volume | 6179.6 ± 1 Å3 |
Cell temperature | 120 K |
Ambient diffraction temperature | 120 K |
Number of distinct elements | 6 |
Space group number | 19 |
Hermann-Mauguin space group symbol | P 21 21 21 |
Hall space group symbol | P 2ac 2ab |
Residual factor for all reflections | 0.046 |
Residual factor for significantly intense reflections | 0.0361 |
Weighted residual factors for significantly intense reflections | 0.0847 |
Weighted residual factors for all reflections included in the refinement | 0.09 |
Goodness-of-fit parameter for significantly intense reflections | 1.39 |
Goodness-of-fit parameter for all reflections included in the refinement | 1.4 |
Diffraction radiation wavelength | 0.71069 Å |
Diffraction radiation type | MoKα |