Information card for entry 4024770
Formula | C16 H12 Cl3 N O3 |
Calculated formula | C16 H12 Cl3 N O3 |
SMILES | ClC(Cl)(Cl)COC(=O)N1C(CC(=O)C=C1)C#Cc1ccccc1 |
Title of publication | Stereocontrolled Synthesis and Pharmacological Evaluation of cis-2,6-Diphenethyl-1-azabicyclo[2.2.2]octanes as Lobelane Analogues |
Authors of publication | Guangrong Zheng; Linda P. Dwoskin; Agripina G. Deaciuc; Peter A. Crooks |
Journal of publication | Journal of Organic Chemistry |
Year of publication | 2009 |
Journal volume | 74 |
Pages of publication | 6072 - 6076 |
a | 9.624 ± 0.0002 Å |
b | 9.9066 ± 0.0002 Å |
c | 10.264 ± 0.0002 Å |
α | 63.082 ± 0.001° |
β | 74.631 ± 0.001° |
γ | 82.194 ± 0.001° |
Cell volume | 841.25 ± 0.03 Å3 |
Cell temperature | 120 ± 0.2 K |
Ambient diffraction temperature | 120 ± 0.2 K |
Number of distinct elements | 5 |
Space group number | 2 |
Hermann-Mauguin space group symbol | P -1 |
Hall space group symbol | -P 1 |
Residual factor for all reflections | 0.0549 |
Residual factor for significantly intense reflections | 0.0411 |
Weighted residual factors for significantly intense reflections | 0.0996 |
Weighted residual factors for all reflections included in the refinement | 0.1068 |
Goodness-of-fit parameter for all reflections included in the refinement | 1.487 |
Diffraction radiation wavelength | 0.71073 Å |
Diffraction radiation type | MoKα |