Information card for entry 4024817
Formula | C28 H33 N O4 S |
Calculated formula | C28 H33 N O4 S |
SMILES | S(=O)(=O)(O[C@@H]1[C@@H](O)[C@H](N(Cc2ccccc2)Cc2ccccc2)CCCC1)c1ccc(C)cc1.S(=O)(=O)(O[C@H]1[C@H](O)[C@@H](N(Cc2ccccc2)Cc2ccccc2)CCCC1)c1ccc(C)cc1 |
Title of publication | Ammonium-Directed Oxidation of Cyclic Allylic and Homoallylic Amines |
Authors of publication | Christopher W. Bond; Alexander J. Cresswell; Stephen G. Davies; Ai M. Fletcher; Wataru Kurosawa; James A. Lee; Paul M. Roberts; Angela J. Russell; Andrew D. Smith; James E. Thomson |
Journal of publication | Journal of Organic Chemistry |
Year of publication | 2009 |
Journal volume | 74 |
Pages of publication | 6735 - 6748 |
a | 9.8999 ± 0.0002 Å |
b | 12.314 ± 0.0003 Å |
c | 20.6999 ± 0.0006 Å |
α | 90° |
β | 91.4895 ± 0.0009° |
γ | 90° |
Cell volume | 2522.62 ± 0.11 Å3 |
Cell temperature | 150 K |
Ambient diffraction temperature | 150 K |
Number of distinct elements | 5 |
Space group number | 14 |
Hermann-Mauguin space group symbol | P 1 21/n 1 |
Hall space group symbol | -P 2yn |
Residual factor for all reflections | 0.1282 |
Residual factor for significantly intense reflections | 0.0654 |
Weighted residual factors for all reflections | 0.1667 |
Weighted residual factors for significantly intense reflections | 0.1293 |
Weighted residual factors for all reflections included in the refinement | 0.1256 |
Goodness-of-fit parameter for all reflections included in the refinement | 0.8781 |
Diffraction radiation wavelength | 0.71073 Å |
Diffraction radiation type | MoKα |