Information card for entry 4024859
Formula | C14 H14 Cl N O2 |
Calculated formula | C14 H14 Cl N O2 |
Title of publication | Supramolecular Synthons in Noncovalent Synthesis of a Class of Gelators Derived from Simple Organic Salts: Instant Gelation of Organic Fluids at Room Temperature via in Situ Synthesis of the Gelators |
Authors of publication | Uttam Kumar Das; Darshak R Trivedi; N. N. Adarsh; Parthasarathi Dastidar |
Journal of publication | Journal of Organic Chemistry |
Year of publication | 2009 |
Journal volume | 74 |
Pages of publication | 7111 - 7121 |
a | 9.1464 ± 0.0013 Å |
b | 29.614 ± 0.004 Å |
c | 9.9453 ± 0.0014 Å |
α | 90° |
β | 90.732 ± 0.003° |
γ | 90° |
Cell volume | 2693.6 ± 0.7 Å3 |
Cell temperature | 298 ± 2 K |
Ambient diffraction temperature | 298 ± 2 K |
Number of distinct elements | 5 |
Space group number | 14 |
Hermann-Mauguin space group symbol | P 1 21/c 1 |
Hall space group symbol | -P 2ybc |
Residual factor for all reflections | 0.1068 |
Residual factor for significantly intense reflections | 0.081 |
Weighted residual factors for significantly intense reflections | 0.1866 |
Weighted residual factors for all reflections included in the refinement | 0.2074 |
Goodness-of-fit parameter for all reflections included in the refinement | 1.178 |
Diffraction radiation wavelength | 0.71073 Å |
Diffraction radiation type | MoKα |