Information card for entry 4024863
Formula | C14 H14 N2 O4 |
Calculated formula | C14 H14 N2 O4 |
Title of publication | Supramolecular Synthons in Noncovalent Synthesis of a Class of Gelators Derived from Simple Organic Salts: Instant Gelation of Organic Fluids at Room Temperature via in Situ Synthesis of the Gelators |
Authors of publication | Uttam Kumar Das; Darshak R Trivedi; N. N. Adarsh; Parthasarathi Dastidar |
Journal of publication | Journal of Organic Chemistry |
Year of publication | 2009 |
Journal volume | 74 |
Pages of publication | 7111 - 7121 |
a | 10.2065 ± 0.0019 Å |
b | 9.2995 ± 0.0017 Å |
c | 28.631 ± 0.005 Å |
α | 90° |
β | 90° |
γ | 90° |
Cell volume | 2717.5 ± 0.9 Å3 |
Cell temperature | 298 ± 2 K |
Ambient diffraction temperature | 298 ± 2 K |
Number of distinct elements | 4 |
Space group number | 61 |
Hermann-Mauguin space group symbol | P b c a |
Hall space group symbol | -P 2ac 2ab |
Residual factor for all reflections | 0.0584 |
Residual factor for significantly intense reflections | 0.0414 |
Weighted residual factors for significantly intense reflections | 0.116 |
Weighted residual factors for all reflections included in the refinement | 0.1318 |
Goodness-of-fit parameter for all reflections included in the refinement | 1.069 |
Diffraction radiation wavelength | 0.71073 Å |
Diffraction radiation type | MoKα |