Information card for entry 4024892
Formula | C26 H12 B F10 N O |
Calculated formula | C26 H12 B F10 N O |
SMILES | [B]1(c2ccccc2C=[N]1c1ccc(cc1)OC)(c1c(c(c(c(c1F)F)F)F)F)c1c(c(c(c(c1F)F)F)F)F |
Title of publication | Fluorescence Properties of Simple N-Substituted Aldimines with a B-N Interaction and Their Fluorescence Quenching by a Cyanide Ion |
Authors of publication | Junro Yoshino; Naokazu Kano; Takayuki Kawashima |
Journal of publication | Journal of Organic Chemistry |
Year of publication | 2009 |
Journal volume | 74 |
Pages of publication | 7496 - 7503 |
a | 9.938 ± 0.003 Å |
b | 15.835 ± 0.005 Å |
c | 14.742 ± 0.005 Å |
α | 90° |
β | 104.326 ± 0.0011° |
γ | 90° |
Cell volume | 2247.7 ± 1.3 Å3 |
Cell temperature | 120 ± 2 K |
Ambient diffraction temperature | 120 ± 2 K |
Number of distinct elements | 6 |
Space group number | 14 |
Hermann-Mauguin space group symbol | P 1 21/c 1 |
Hall space group symbol | -P 2ybc |
Residual factor for all reflections | 0.0342 |
Residual factor for significantly intense reflections | 0.0311 |
Weighted residual factors for significantly intense reflections | 0.0819 |
Weighted residual factors for all reflections included in the refinement | 0.0846 |
Goodness-of-fit parameter for all reflections included in the refinement | 1.056 |
Diffraction radiation wavelength | 0.7107 Å |
Diffraction radiation type | MoKα |