Information card for entry 4024958
Formula | C12 H13 Br2 N |
Calculated formula | C12 H13 Br2 N |
SMILES | Br[C@@H]1C2N(CC1[C@H]2Br)Cc1ccccc1 |
Title of publication | 5(6)-anti-Substituted-2-azabicyclo[2.1.1]hexanes: A Nucleophilic Displacement Route |
Authors of publication | Grant R. Krow; Ram Edupuganti; Deepa Gandla; Amit Choudhary; Guoliang Lin; Philip E. Sonnet; Charles DeBrosse; Charles W. Ross; Kevin C. Cannon; Ronald T. Raines |
Journal of publication | Journal of Organic Chemistry |
Year of publication | 2009 |
Journal volume | 74 |
Pages of publication | 8232 - 8242 |
a | 7.2022 ± 0.0009 Å |
b | 10.808 ± 0.0013 Å |
c | 15.863 ± 0.002 Å |
α | 90° |
β | 99.586 ± 0.002° |
γ | 90° |
Cell volume | 1217.5 ± 0.3 Å3 |
Cell temperature | 100 ± 2 K |
Ambient diffraction temperature | 100 ± 2 K |
Number of distinct elements | 4 |
Space group number | 14 |
Hermann-Mauguin space group symbol | P 1 21/n 1 |
Hall space group symbol | -P 2yn |
Residual factor for all reflections | 0.0343 |
Residual factor for significantly intense reflections | 0.0286 |
Weighted residual factors for significantly intense reflections | 0.0717 |
Weighted residual factors for all reflections included in the refinement | 0.0759 |
Goodness-of-fit parameter for all reflections included in the refinement | 1.067 |
Diffraction radiation wavelength | 0.71073 Å |
Diffraction radiation type | MoKα |