Information card for entry 4024962
Formula | C19 H21 N O2 |
Calculated formula | C19 H21 N O2 |
SMILES | O=C1NCC2(C(=O)c3c1cccc3)C1CC3CC2CC(C1)C3 |
Title of publication | Photoinitiated Domino Reactions: N-(Adamantyl)phthalimides and N-(Adamantylalkyl)phthalimides |
Authors of publication | Margareta Horvat; Helmut Görner; Klaus-Dieter Warzecha; Jörg Neudörfl; Axel G. Griesbeck; Kata Mlinarić-Majerski; Nikola Basarić |
Journal of publication | Journal of Organic Chemistry |
Year of publication | 2009 |
Journal volume | 74 |
Pages of publication | 8219 - 8231 |
a | 9.8165 ± 0.0007 Å |
b | 9.4087 ± 0.0007 Å |
c | 32.345 ± 0.002 Å |
α | 90° |
β | 97.08 ± 0.003° |
γ | 90° |
Cell volume | 2964.6 ± 0.4 Å3 |
Cell temperature | 100 ± 2 K |
Ambient diffraction temperature | 100 ± 2 K |
Number of distinct elements | 4 |
Space group number | 15 |
Hermann-Mauguin space group symbol | C 1 2/c 1 |
Hall space group symbol | -C 2yc |
Residual factor for all reflections | 0.1111 |
Residual factor for significantly intense reflections | 0.0418 |
Weighted residual factors for significantly intense reflections | 0.0732 |
Weighted residual factors for all reflections included in the refinement | 0.085 |
Goodness-of-fit parameter for all reflections included in the refinement | 0.829 |
Diffraction radiation wavelength | 0.71073 Å |
Diffraction radiation type | MoKα |