Information card for entry 4024984
Common name | tetra(2,4,6-trimethylphenyl)pyrene |
Chemical name | tetra(2,4,6-trimethylphenyl)pyrene |
Formula | C113 H112 |
Calculated formula | C113 H112 |
Title of publication | Abundant Lattice Inclusion Phenomenon with Sterically Hindered and Inherently Shape-Selective Tetraarylpyrenes |
Authors of publication | Jarugu Narasimha Moorthy; Palani Natarajan; Paloth Venugopalan |
Journal of publication | Journal of Organic Chemistry |
Year of publication | 2009 |
Journal volume | 74 |
Pages of publication | 8566 - 8577 |
a | 27.309 ± 0.002 Å |
b | 16.35 ± 0.0013 Å |
c | 39.232 ± 0.003 Å |
α | 90° |
β | 100.78 ± 0.002° |
γ | 90° |
Cell volume | 17208 ± 3 Å3 |
Cell temperature | 100 ± 2 K |
Ambient diffraction temperature | 100 ± 2 K |
Number of distinct elements | 2 |
Space group number | 13 |
Hermann-Mauguin space group symbol | P 1 2/n 1 |
Hall space group symbol | -P 2yac |
Residual factor for all reflections | 0.1304 |
Residual factor for significantly intense reflections | 0.0849 |
Weighted residual factors for significantly intense reflections | 0.0938 |
Weighted residual factors for all reflections included in the refinement | 0.1073 |
Goodness-of-fit parameter for all reflections included in the refinement | 1.031 |
Diffraction radiation wavelength | 0.71073 Å |
Diffraction radiation type | MoKα |