Information card for entry 4025003
Common name | tetra(2,6-dimethyl-4-methoxyphenyl)pyrene |
Chemical name | tetra(2,6-dimethyl-4-methoxyphenyl)pyrene |
Formula | C119 H109 Cl3 N2 O8 |
Calculated formula | C118 H108 N2 O8 |
Title of publication | Abundant Lattice Inclusion Phenomenon with Sterically Hindered and Inherently Shape-Selective Tetraarylpyrenes |
Authors of publication | Jarugu Narasimha Moorthy; Palani Natarajan; Paloth Venugopalan |
Journal of publication | Journal of Organic Chemistry |
Year of publication | 2009 |
Journal volume | 74 |
Pages of publication | 8566 - 8577 |
a | 20.637 ± 0.003 Å |
b | 21.858 ± 0.003 Å |
c | 22.694 ± 0.003 Å |
α | 90° |
β | 108.444 ± 0.004° |
γ | 90° |
Cell volume | 9711 ± 2 Å3 |
Cell temperature | 298 ± 2 K |
Ambient diffraction temperature | 298 ± 2 K |
Number of distinct elements | 5 |
Space group number | 15 |
Hermann-Mauguin space group symbol | C 1 2/c 1 |
Hall space group symbol | -C 2yc |
Residual factor for all reflections | 0.1131 |
Residual factor for significantly intense reflections | 0.0794 |
Weighted residual factors for significantly intense reflections | 0.1976 |
Weighted residual factors for all reflections included in the refinement | 0.2167 |
Goodness-of-fit parameter for all reflections included in the refinement | 1.019 |
Diffraction radiation wavelength | 0.71073 Å |
Diffraction radiation type | MoKα |